Reaction Details
TargetCytochrome c oxidase subunit 1
LigandBDBM50229774
Substrate/Competitorn/a
Meas. Tech.ChEMBL_530100 (CHEMBL967598)
IC50 157200±n/a nM
Citation Erdélyi, PFodor, TVarga, AKCzugler, MGere, AFischer, J Chemical and biological investigation of N-hydroxy-valdecoxib: An active metabolite of valdecoxib. Bioorg Med Chem16:5322-30 (2008) 
 
Cytochrome c oxidase subunit 1
Name:Cytochrome c oxidase subunit 1
Type:PROTEIN
Mol. Mass.:57042.19
Organism:Ovis aries
Description:ChEMBL_662814
Residue:514
BDBM50229774
NameBDBM50229774
Synonyms:CHEMBL254418 N-hydroxy-4-(5-methyl-3-phenylisoxazol-4-yl)benzenesulfonamide hydrate
TypeSmall organic molecule
Emp. Form.C16H14N2O4S
Mol. Mass.330.358
SMILESCc1onc(c1-c1ccc(cc1)S(=O)(=O)NO)-c1ccccc1