Reaction Details
TargetMatrix metalloproteinase-9
LigandBDBM50247490
Substrate/Competitorn/a
Meas. Tech.ChEMBL_518918 (CHEMBL940662)
IC50 160±n/a nM
Citation Nakai, RSalisbury, CMRosen, HCravatt, BF Ranking the selectivity of PubChem screening hits by activity-based protein profiling: MMP13 as a case study. Bioorg Med Chem17:1101-8 (2009) 
 
Matrix metalloproteinase-9
Name:Matrix metalloproteinase-9
Type:Enzyme
Mol. Mass.:78452.28
Organism:Homo sapiens (Human)
Description:P14780
Residue:707
BDBM50247490
NameBDBM50247490
Synonyms:4-amino-3-(4-(hexyloxy)phenyl)-4-oxobutanoic acid cid_651854
TypeSmall organic molecule
Emp. Form.C16H23NO4
Mol. Mass.293.3581
SMILESCCCCCCOc1ccc(cc1)C(CC(O)=O)C(N)=O