Reaction Details
TargetMatrix metalloproteinase-9
LigandBDBM50247207
Substrate/Competitorn/a
Meas. Tech.ChEMBL_518918 (CHEMBL940662)
IC50 14000±n/a nM
Citation Nakai, RSalisbury, CMRosen, HCravatt, BF Ranking the selectivity of PubChem screening hits by activity-based protein profiling: MMP13 as a case study. Bioorg Med Chem17:1101-8 (2009) 
 
Matrix metalloproteinase-9
Name:Matrix metalloproteinase-9
Type:Enzyme
Mol. Mass.:78452.28
Organism:Homo sapiens (Human)
Description:P14780
Residue:707
BDBM50247207
NameBDBM50247207
Synonyms:2-(biphenyl-4-ylsulfonamido)pentanedioic acid | CHEMBL475540
TypeSmall organic molecule
Emp. Form.C17H17NO6S
Mol. Mass.363.385
SMILESOC(=O)CCC(NS(=O)(=O)c1ccc(cc1)-c1ccccc1)C(O)=O