Reaction Details
TargetNeutrophil collagenase
LigandBDBM40478
Substrate/Competitorn/a
Meas. Tech.ChEMBL_518917 (CHEMBL940661)
IC50>100000±n/a nM
Citation Nakai, RSalisbury, CMRosen, HCravatt, BF Ranking the selectivity of PubChem screening hits by activity-based protein profiling: MMP13 as a case study. Bioorg Med Chem17:1101-8 (2009) 
 
Neutrophil collagenase
Name:Neutrophil collagenase
Type:Enzyme
Mol. Mass.:53413.48
Organism:Homo sapiens (Human)
Description:P22894
Residue:467
BDBM40478
NameBDBM40478
Synonyms:2-[(4-methoxyphenyl)methylsulfanyl]-6-methyl-1H-pyrimidin-4-one 6-methyl-2-(p-anisylthio)-1H-pyrimidin-4-one MLS000109390 cid_716696
TypeSmall organic molecule
Emp. Form.C13H14N2O2S
Mol. Mass.262.327
SMILESCOc1ccc(CSc2nc(C)cc(=O)[nH]2)cc1