Reaction Details
TargetTransient receptor potential cation channel subfamily V member 1
LigandBDBM20557
Substrate/Competitorn/a
Meas. Tech.ChEMBL_532536 (CHEMBL976972)
pH5±n/a
IC50 0.500000±n/a nM
Commentsextracted
Citation Tamayo, NLiao, HStec, MMWang, XChakrabarti, PRetz, DDoherty, EMSurapaneni, STamir, RBannon, AWGavva, NRNorman, MH Design and synthesis of peripherally restricted transient receptor potential vanilloid 1 (TRPV1) antagonists. J Med Chem51:2744-57 (2008) 
 
Transient receptor potential cation channel subfamily V member 1
Name:Transient receptor potential cation channel subfamily V member 1
Type:Transient Receptor
Mol. Mass.:94956.12
Organism:Rattus norvegicus (rat)
Description:O35433
Residue:838
BDBM20557
NameBDBM20557
Synonyms:AMG 517 JMC503515 Compound 23 US8796328, A | US8802711, H
TypeSmall organic molecule
Emp. Form.C20H13F3N4O2S
Mol. Mass.430.403
SMILESCC(=O)Nc1nc2c(Oc3cc(ncn3)-c3ccc(cc3)C(F)(F)F)cccc2s1