Reaction Details
TargetTransient receptor potential cation channel subfamily V member 1
LigandBDBM50261295
Substrate/Competitorn/a
Meas. Tech.ChEMBL_532535 (CHEMBL976971)
IC50 0.700000±n/a nM
Citation Tamayo, NLiao, HStec, MMWang, XChakrabarti, PRetz, DDoherty, EMSurapaneni, STamir, RBannon, AWGavva, NRNorman, MH Design and synthesis of peripherally restricted transient receptor potential vanilloid 1 (TRPV1) antagonists. J Med Chem51:2744-57 (2008) 
 
Transient receptor potential cation channel subfamily V member 1
Name:Transient receptor potential cation channel subfamily V member 1
Type:Transient Receptor
Mol. Mass.:94956.12
Organism:Rattus norvegicus (rat)
Description:O35433
Residue:838
BDBM50261295
NameBDBM50261295
Synonyms:3-Amino-5-(6-(2-(2-methoxyethylamino)-6-(trifluoromethyl)-pyridin-3-yl)pyrimidin-4-yloxy)quinoxalin-2(1H)-one | CHEMBL468751
TypeSmall organic molecule
Emp. Form.C21H18F3N7O3
Mol. Mass.473.4079
SMILESCOCCNc1nc(ccc1-c1cc(Oc2cccc3[nH]c(=O)c(N)nc23)ncn1)C(F)(F)F