Reaction Details
TargetTransient receptor potential cation channel subfamily V member 1
LigandBDBM50261646
Substrate/Competitorn/a
Meas. Tech.ChEMBL_532536 (CHEMBL976972)
pH5±n/a
IC50 0.300000±n/a nM
Commentsextracted
Citation Tamayo, NLiao, HStec, MMWang, XChakrabarti, PRetz, DDoherty, EMSurapaneni, STamir, RBannon, AWGavva, NRNorman, MH Design and synthesis of peripherally restricted transient receptor potential vanilloid 1 (TRPV1) antagonists. J Med Chem51:2744-57 (2008) 
 
Transient receptor potential cation channel subfamily V member 1
Name:Transient receptor potential cation channel subfamily V member 1
Type:Transient Receptor
Mol. Mass.:94956.12
Organism:Rattus norvegicus (rat)
Description:O35433
Residue:838
BDBM50261646
NameBDBM50261646
Synonyms:(R)-3-Amino-5-(2-(1-methoxypropan-2-ylamino)-6-(4-(trifluoromethyl)phenyl)pyrimidin-4-yloxy)quinoxalin-2(1H)-one | CHEMBL469235
TypeSmall organic molecule
Emp. Form.C23H21F3N6O3
Mol. Mass.486.4464
SMILESCOC[C@@H](C)Nc1nc(Oc2cccc3[nH]c(=O)c(N)nc23)cc(n1)-c1ccc(cc1)C(F)(F)F