Reaction Details
TargetTransient receptor potential cation channel subfamily V member 1
LigandBDBM50261150
Substrate/Competitorn/a
Meas. Tech.ChEMBL_532535 (CHEMBL976971)
IC50 0.600000±n/a nM
Citation Tamayo, NLiao, HStec, MMWang, XChakrabarti, PRetz, DDoherty, EMSurapaneni, STamir, RBannon, AWGavva, NRNorman, MH Design and synthesis of peripherally restricted transient receptor potential vanilloid 1 (TRPV1) antagonists. J Med Chem51:2744-57 (2008) 
 
Transient receptor potential cation channel subfamily V member 1
Name:Transient receptor potential cation channel subfamily V member 1
Type:Transient Receptor
Mol. Mass.:94956.12
Organism:Rattus norvegicus (rat)
Description:O35433
Residue:838
BDBM50261150
NameBDBM50261150
Synonyms:3-Amino-5-(2-(2-methoxyethylamino)-6-(4-(trifluoromethyl)-phenyl)pyrimidin-4-yloxy)quinoxalin-2(1H)-one | CHEMBL493806
TypeSmall organic molecule
Emp. Form.C22H19F3N6O3
Mol. Mass.472.4199
SMILESCOCCNc1nc(Oc2cccc3[nH]c(=O)c(N)nc23)cc(n1)-c1ccc(cc1)C(F)(F)F