Reaction Details
TargetTransient receptor potential cation channel subfamily V member 1
LigandBDBM50261317
Substrate/Competitorn/a
Meas. Tech.ChEMBL_532536 (CHEMBL976972)
pH5±n/a
IC50 1.7±n/a nM
Commentsextracted
Citation Tamayo, NLiao, HStec, MMWang, XChakrabarti, PRetz, DDoherty, EMSurapaneni, STamir, RBannon, AWGavva, NRNorman, MH Design and synthesis of peripherally restricted transient receptor potential vanilloid 1 (TRPV1) antagonists. J Med Chem51:2744-57 (2008) 
 
Transient receptor potential cation channel subfamily V member 1
Name:Transient receptor potential cation channel subfamily V member 1
Type:Transient Receptor
Mol. Mass.:94956.12
Organism:Rattus norvegicus (rat)
Description:O35433
Residue:838
BDBM50261317
NameBDBM50261317
Synonyms:3-Amino-5-(6-(2-((1-isobutylpiperidin-2-yl)methylamino)-6-(trifluoromethyl)pyridin-3-yl)pyrimidin-4-yloxy)quinoxalin-2(1H)-one | CHEMBL448574
TypeSmall organic molecule
Emp. Form.C28H31F3N8O2
Mol. Mass.568.5933
SMILESCC(C)CN1CCCCC1CNc1nc(ccc1-c1cc(Oc2cccc3[nH]c(=O)c(N)nc23)ncn1)C(F)(F)F