Reaction Details
TargetTransient receptor potential cation channel subfamily V member 1
LigandBDBM50261316
Substrate/Competitorn/a
Meas. Tech.ChEMBL_532535 (CHEMBL976971)
IC50 2.2±n/a nM
Citation Tamayo, NLiao, HStec, MMWang, XChakrabarti, PRetz, DDoherty, EMSurapaneni, STamir, RBannon, AWGavva, NRNorman, MH Design and synthesis of peripherally restricted transient receptor potential vanilloid 1 (TRPV1) antagonists. J Med Chem51:2744-57 (2008) 
 
Transient receptor potential cation channel subfamily V member 1
Name:Transient receptor potential cation channel subfamily V member 1
Type:Transient Receptor
Mol. Mass.:94956.12
Organism:Rattus norvegicus (rat)
Description:O35433
Residue:838
BDBM50261316
NameBDBM50261316
Synonyms:3-Amino-5-(6-(2-(2-morpholinoethylamino)-6-(trifluoromethyl)pyridin-3-yl)pyrimidin-4-yloxy)quinoxalin-2(1H)-one | CHEMBL511393
TypeSmall organic molecule
Emp. Form.C24H23F3N8O3
Mol. Mass.528.4864
SMILESNc1nc2c(Oc3cc(ncn3)-c3ccc(nc3NCCN3CCOCC3)C(F)(F)F)cccc2[nH]c1=O