Reaction Details
TargetPyruvate kinase
LigandBDBM50270347
Substrate/Competitorn/a
Meas. Tech.ChEMBL_530311 (CHEMBL980373)
IC50 1500000±n/a nM
Citation Nowicki, MWTulloch, LBWorralll, LMcNae, IWHannaert, VMichels, PAFothergill-Gilmore, LAWalkinshaw, MDTurner, NJ Design, synthesis and trypanocidal activity of lead compounds based on inhibitors of parasite glycolysis. Bioorg Med Chem16:5050-61 (2008) 
 
Pyruvate kinase
Name:Pyruvate kinase
Type:PROTEIN
Mol. Mass.:54404.51
Organism:Leishmania mexicana
Description:ChEMBL_530311
Residue:499
BDBM50270347
NameBDBM50270347
Synonyms:(2R,3S,4S,5R)-2-(((1R,2S,4R)-bicyclo[2.2.1]heptan-2-ylamino)methyl)-5-(hydroxymethyl)-tetrahydrofuran-3,4-diol | CHEMBL479181
TypeSmall organic molecule
Emp. Form.C13H23NO4
Mol. Mass.257.326
SMILESOC[C@H]1O[C@H](CN[C@H]2C[C@@H]3CC[C@@H]2C3)[C@@H](O)[C@@H]1O