Reaction Details
TargetRegulatory protein E2
LigandBDBM50035218
Substrate/Competitorn/a
Meas. Tech.ChEMBL_532976 (CHEMBL989646)
Kd 1050±n/a nM
Citation Saitoh, TKuramochi, KImai, TTakata, KTakehara, MKobayashi, SSakaguchi, KSugawara, F Podophyllotoxin directly binds a hinge domain in E2 of HPV and inhibits an E2/E7 interaction in vitro. Bioorg Med Chem16:5815-25 (2008) 
 
Regulatory protein E2
Name:Regulatory protein E2
Type:PROTEIN
Mol. Mass.:45494.82
Organism:Human papillomavirus type 1a
Description:ChEMBL_532977
Residue:401
BDBM50035218
NameBDBM50035218
Synonyms:CHEMBL61 Podophyllinic acid lactone podophyllotoxin
TypeSmall organic molecule
Emp. Form.C22H22O8
Mol. Mass.414.4053
SMILESCOc1cc(cc(OC)c1OC)[C@H]1[C@@H]2[C@H](COC2=O)[C@@H](O)c2cc3OCOc3cc12