Reaction Details
TargetMelanocortin receptor 4
LigandBDBM50224184
Substrate/Competitorn/a
Meas. Tech.ChEMBL_533293 (CHEMBL973312)
Ki 0.600000±n/a nM
Citation Chen, CTucci, FCJiang, WTran, JAFleck, BAHoare, SRWen, JChen, TJohns, MMarkison, SFoster, ACMarinkovic, DChen, CWArellano, MHarman, JSaunders, JBozigian, HMarks, D Pharmacological and pharmacokinetic characterization of 2-piperazine-alpha-isopropyl benzylamine derivatives as melanocortin-4 receptor antagonists. Bioorg Med Chem16:5606-18 (2008) 
 
Melanocortin receptor 4
Name:Melanocortin receptor 4
Type:Enzyme
Mol. Mass.:36949.50
Organism:Homo sapiens (Human)
Description:P32245
Residue:332
BDBM50224184
NameBDBM50224184
Synonyms:1-{2-[(1S)-(3-dimethylaminopropionyl)amino-2-methylpropyl]-4-methylphenyl}-4-[(2R)-methyl-3-(2-methyl-4-chlorophenyl)propionyl]piperazine N-((S)-1-(2-(4-((R)-3-(4-chloro-2-methylphenyl)-2-methylpropanoyl)piperazin-1-yl)-5-methylphenyl)-2-methylpropyl)-3-(dimethylamino)propanamide
TypeSmall organic molecule
Emp. Form.C31H45ClN4O2
Mol. Mass.541.168
SMILESCC(C)[C@H](NC(=O)CCN(C)C)c1cc(C)ccc1N1CCN(CC1)C(=O)[C@H](C)Cc1ccc(Cl)cc1C