Reaction Details
TargetMelanocortin receptor 4
LigandBDBM50261229
Substrate/Competitorn/a
Meas. Tech.ChEMBL_533294 (CHEMBL976122)
IC50 150±n/a nM
Citation Chen, CTucci, FCJiang, WTran, JAFleck, BAHoare, SRWen, JChen, TJohns, MMarkison, SFoster, ACMarinkovic, DChen, CWArellano, MHarman, JSaunders, JBozigian, HMarks, D Pharmacological and pharmacokinetic characterization of 2-piperazine-alpha-isopropyl benzylamine derivatives as melanocortin-4 receptor antagonists. Bioorg Med Chem16:5606-18 (2008) 
 
Melanocortin receptor 4
Name:Melanocortin receptor 4
Type:Enzyme
Mol. Mass.:36949.50
Organism:Homo sapiens (Human)
Description:P32245
Residue:332
BDBM50261229
NameBDBM50261229
Synonyms:1-{2-[(1S)-((2R)-Aminopropionamido)-2-methylpropyl]-4-chlorophenyl}-4-[(2R)-methyl-3-(2-methoxy-4-dichlorophenyl)propionyl]piperazine | CHEMBL467587
TypeSmall organic molecule
Emp. Form.C28H38Cl2N4O3
Mol. Mass.549.532
SMILESCOc1cc(Cl)ccc1C[C@@H](C)C(=O)N1CCN(CC1)c1ccc(Cl)cc1[C@@H](NC(=O)[C@@H](C)N)C(C)C