Reaction Details
TargetAcetylcholinesterase
LigandBDBM50261237
Substrate/Competitorn/a
Meas. Tech.ChEMBL_555909 (CHEMBL956645)
IC50 281000±n/a nM
Citation Rizzo, SRivière, CPiazzi, LBisi, AGobbi, SBartolini, MAndrisano, VMorroni, FTarozzi, AMonti, JPRampa, A Benzofuran-based hybrid compounds for the inhibition of cholinesterase activity, beta amyloid aggregation, and abeta neurotoxicity. J Med Chem51:2883-6 (2008) 
 
Acetylcholinesterase
Name:Acetylcholinesterase
Type:Enzyme
Mol. Mass.:67792.70
Organism:Homo sapiens (Human)
Description:P22303
Residue:614
BDBM50261237
NameBDBM50261237
Synonyms:(2-{4-[7-(benzylmethylamino)heptyloxy]phenyl}benzofuran-3-yl)-(4-methoxyphenyl)-methanone | CHEMBL444427
TypeSmall organic molecule
Emp. Form.C37H39NO4
Mol. Mass.561.7099
SMILESCOc1ccc(cc1)C(=O)c1c(oc2ccccc12)-c1ccc(OCCCCCCCN(C)Cc2ccccc2)cc1