Reaction Details
TargetAcetylcholinesterase
LigandBDBM50261232
Substrate/Competitorn/a
Meas. Tech.ChEMBL_555909 (CHEMBL956645)
IC50 17400±n/a nM
Citation Rizzo, SRivière, CPiazzi, LBisi, AGobbi, SBartolini, MAndrisano, VMorroni, FTarozzi, AMonti, JPRampa, A Benzofuran-based hybrid compounds for the inhibition of cholinesterase activity, beta amyloid aggregation, and abeta neurotoxicity. J Med Chem51:2883-6 (2008) 
 
Acetylcholinesterase
Name:Acetylcholinesterase
Type:Enzyme
Mol. Mass.:67792.70
Organism:Homo sapiens (Human)
Description:P22303
Residue:614
BDBM50261232
NameBDBM50261232
Synonyms:1-(2-{4-[7-(Benzylmethylamino)heptyloxy]phenyl}benzofuran-3-yl)ethanone | CHEMBL511948
TypeSmall organic molecule
Emp. Form.C31H35NO3
Mol. Mass.469.6145
SMILESCN(CCCCCCCOc1ccc(cc1)-c1oc2ccccc2c1C(C)=O)Cc1ccccc1