Reaction Details
TargetCholinesterase
LigandBDBM50261233
Substrate/Competitorn/a
Meas. Tech.ChEMBL_555910 (CHEMBL956646)
IC50 38100±n/a nM
Citation Rizzo, SRivière, CPiazzi, LBisi, AGobbi, SBartolini, MAndrisano, VMorroni, FTarozzi, AMonti, JPRampa, A Benzofuran-based hybrid compounds for the inhibition of cholinesterase activity, beta amyloid aggregation, and abeta neurotoxicity. J Med Chem51:2883-6 (2008) 
 
Cholinesterase
Name:Cholinesterase
Type:Homotetramer
Mol. Mass.:68422.27
Organism:Homo sapiens (Human)
Description:P06276
Residue:602
BDBM50261233
NameBDBM50261233
Synonyms:(2-{4-[7-(benzylmethylamino)heptyloxy]phenyl}benzofuran-3-yl)phenylmethanone | CHEMBL511575
TypeSmall organic molecule
Emp. Form.C36H37NO3
Mol. Mass.531.6839
SMILESCN(CCCCCCCOc1ccc(cc1)-c1oc2ccccc2c1C(=O)c1ccccc1)Cc1ccccc1