Reaction Details
TargetGonadotropin-releasing hormone receptor
LigandBDBM50261244
Substrate/Competitorn/a
Meas. Tech.ChEMBL_555922 (CHEMBL956658)
Ki 40±n/a nM
Citation Betz, SFZhu, YFChen, CStruthers, RS Non-peptide gonadotropin-releasing hormone receptor antagonists. J Med Chem51:3331-48 (2008) 
 
Gonadotropin-releasing hormone receptor
Name:Gonadotropin-releasing hormone receptor
Type:Enzyme
Mol. Mass.:37749.45
Organism:Homo sapiens (Human)
Description:P30968
Residue:328
BDBM50261244
NameBDBM50261244
Synonyms:6-((R)-2-amino-2-phenylethyl)-8-(2-fluoro-3-methoxyphenyl)-3-(2-fluorophenyl)-2,3-dihydro-6H-thiazolo[3,2-f]pyrimidine-5,7-dione | CHEMBL468552
TypeSmall organic molecule
Emp. Form.C27H23F2N3O3S
Mol. Mass.507.552
SMILESCOc1cccc(c1F)-c1c2SCC(c3ccccc3F)n2c(=O)n(C[C@H](N)c2ccccc2)c1=O