Reaction Details
TargetGonadotropin-releasing hormone receptor
LigandBDBM50098391
Substrate/Competitorn/a
Meas. Tech.ChEMBL_555946 (CHEMBL959130)
IC50 7±n/a nM
Citation Betz, SFZhu, YFChen, CStruthers, RS Non-peptide gonadotropin-releasing hormone receptor antagonists. J Med Chem51:3331-48 (2008) 
 
Gonadotropin-releasing hormone receptor
Name:Gonadotropin-releasing hormone receptor
Type:PROTEIN
Mol. Mass.:7087.59
Organism:Macaca mulatta
Description:ChEMBL_495156
Residue:59
BDBM50098391
NameBDBM50098391
Synonyms:(S)-4-(2-(azetidin-2-yl)ethoxy)-7-chloro-2-oxo-N-(pyrimidin-4-yl)-3-(3,4,5-trimethylphenyl)-1,2-dihydroquinoline-6-carboxamide 4-(2-Azetidin-2-yl-ethoxy)-7-chloro-2-oxo-3-(3,4,5-trimethyl-phenyl)-1,2-dihydro-quinoline-6-carboxylic acid pyrimidin-4-ylamide | CHEMBL120432
TypeSmall organic molecule
Emp. Form.C28H28ClN5O3
Mol. Mass.518.007
SMILESCc1cc(cc(C)c1C)-c1c(OCC[C@@H]2CCN2)c2cc(C(=O)Nc3ccncn3)c(Cl)cc2[nH]c1=O