Reaction Details
TargetTyrosine-protein phosphatase non-receptor type 1
LigandBDBM50266159
Substrate/Competitorn/a
Meas. Tech.ChEMBL_544687 (CHEMBL1009264)
Ki 35000±n/a nM
Citation Kumar, AAhmad, PMaurya, RASingh, ABSrivastava, AK Novel 2-aryl-naphtho[1,2-d]oxazole derivatives as potential PTP-1B inhibitors showing antihyperglycemic activities. Eur J Med Chem44:109-16 (2008) 
 
Tyrosine-protein phosphatase non-receptor type 1
Name:Tyrosine-protein phosphatase non-receptor type 1
Type:Protein phosphatase
Mol. Mass.:49963.76
Organism:Homo sapiens (Human)
Description:Human recombinant GST-fusion PTP1B (1-435).
Residue:435
BDBM50266159
NameBDBM50266159
Synonyms:CHEMBL506882 | Diethyl-[2-(4-naphtho[1,2-d]oxazol-2-yl-phenoxy)-ethyl]-amine
TypeSmall organic molecule
Emp. Form.C23H24N2O2
Mol. Mass.360.4489
SMILESCCN(CC)CCOc1ccc(cc1)-c1nc2c(ccc3ccccc23)o1