Reaction Details
TargetTyrosine-protein phosphatase non-receptor type 1
LigandBDBM50266162
Substrate/Competitorn/a
Meas. Tech.ChEMBL_544687 (CHEMBL1009264)
Ki 44400±n/a nM
Citation Kumar, AAhmad, PMaurya, RASingh, ABSrivastava, AK Novel 2-aryl-naphtho[1,2-d]oxazole derivatives as potential PTP-1B inhibitors showing antihyperglycemic activities. Eur J Med Chem44:109-16 (2008) 
 
Tyrosine-protein phosphatase non-receptor type 1
Name:Tyrosine-protein phosphatase non-receptor type 1
Type:Protein phosphatase
Mol. Mass.:49963.76
Organism:Homo sapiens (Human)
Description:Human recombinant GST-fusion PTP1B (1-435).
Residue:435
BDBM50266162
NameBDBM50266162
Synonyms:Butyl-methyl-[2-(4-naphtho[1,2-d]oxazol-2-yl-phenoxy)-ethyl]-amine | CHEMBL512442
TypeSmall organic molecule
Emp. Form.C24H26N2O2
Mol. Mass.374.4754
SMILESCCCCN(C)CCOc1ccc(cc1)-c1nc2c(ccc3ccccc23)o1