Reaction Details
Target11-beta-hydroxysteroid dehydrogenase 1
LigandBDBM50260938
Substrate/Competitorn/a
Meas. Tech.ChEMBL_552254 (CHEMBL995584)
IC50 1±n/a nM
Citation Zhu, YOlson, SHHermanowski-Vosatka, AMundt, SShah, KSpringer, MThieringer, RWright, SXiao, JZokian, HBalkovec, JM 4-Methyl-5-phenyl triazoles as selective inhibitors of 11beta-hydroxysteroid dehydrogenase type I. Bioorg Med Chem Lett18:3405-11 (2008) 
 
11-beta-hydroxysteroid dehydrogenase 1
Name:11-beta-hydroxysteroid dehydrogenase 1
Type:Enzyme
Mol. Mass.:32409.16
Organism:Homo sapiens (Human)
Description:P28845
Residue:292
BDBM50260938
NameBDBM50260938
Synonyms:3-(2-chloro-4-(1H-imidazol-1-yl)phenyl)-5-(1-(4-chlorophenyl)cyclobutyl)-4-methyl-4H-1,2,4-triazole | CHEMBL523414
TypeSmall organic molecule
Emp. Form.C22H19Cl2N5
Mol. Mass.424.326
SMILESCn1c(nnc1C1(CCC1)c1ccc(Cl)cc1)-c1ccc(cc1Cl)-n1ccnc1