Reaction Details
TargetStromelysin-2
LigandBDBM50260802
Substrate/Competitorn/a
Meas. Tech.ChEMBL_552278 (CHEMBL995608)
Ki 356±n/a nM
Citation Subramaniam, RHaldar, MKTobwala, SGanguly, BSrivastava, DKMallik, S Novel bis-(arylsulfonamide) hydroxamate-based selective MMP inhibitors. Bioorg Med Chem Lett18:3333-7 (2008) 
 
Stromelysin-2
Name:Stromelysin-2
Type:Enzyme
Mol. Mass.:54143.02
Organism:Homo sapiens (Human)
Description:P09238
Residue:476
BDBM50260802
NameBDBM50260802
Synonyms:CHEMBL496717 | N-hydroxy-2,3-bis(phenylsulfonamido)propanamide
TypeSmall organic molecule
Emp. Form.C15H17N3O6S2
Mol. Mass.399.442
SMILESONC(=O)C(CNS(=O)(=O)c1ccccc1)NS(=O)(=O)c1ccccc1