Reaction Details
TargetGonadotropin-releasing hormone receptor
LigandBDBM50166450
Substrate/Competitorn/a
Meas. Tech.ChEMBL_552282 (CHEMBL995612)
Ki 0.64±n/a nM
Citation Chen, CChen, YPontillo, JGuo, ZHuang, CQWu, DMadan, AChen, TWen, JXie, QTucci, FCRowbottom, MZhu, YFWade, WSaunders, JBozigian, HStruthers, RS Potent and orally bioavailable zwitterion GnRH antagonists with low CYP3A4 inhibitory activity. Bioorg Med Chem Lett18:3301-5 (2008) 
 
Gonadotropin-releasing hormone receptor
Name:Gonadotropin-releasing hormone receptor
Type:Enzyme
Mol. Mass.:37749.45
Organism:Homo sapiens (Human)
Description:P30968
Residue:328
BDBM50166450
NameBDBM50166450
Synonyms:(R)-1-(2-fluoro-6-(trifluoromethyl)benzyl)-3-(2-amino-2-phenylethyl)-5-(2-fluoro-3-methoxyphenyl)pyrimidine-2,4(1H,3H)-dione 3-((R)-2-Amino-2-phenyl-ethyl)-5-(2-fluoro-3-methoxy-phenyl)-1-(2-fluoro-6-trifluoromethyl-benzyl)-1H-pyrimidine-2,4-dione | CHEMBL434936
TypeSmall organic molecule
Emp. Form.C27H22F5N3O3
Mol. Mass.531.4739
SMILESCOc1cccc(c1F)-c1cn(Cc2c(F)cccc2C(F)(F)F)c(=O)n(C[C@H](N)c2ccccc2)c1=O