Reaction Details
TargetProteinase-activated receptor 1
LigandBDBM50260517
Substrate/Competitorn/a
Meas. Tech.ChEMBL_556010 (CHEMBL964660)
Ki 367±n/a nM
Citation Chackalamannil, SWang, YGreenlee, WJHu, ZXia, YAhn, HSBoykow, GHsieh, YPalamanda, JAgans-Fantuzzi, JKurowski, SGraziano, MChintala, M Discovery of a novel, orally active himbacine-based thrombin receptor antagonist (SCH 530348) with potent antiplatelet activity. J Med Chem51:3061-4 (2008) 
 
Proteinase-activated receptor 1
Name:Proteinase-activated receptor 1
Type:Protein
Mol. Mass.:47450.07
Organism:Homo sapiens (Human)
Description:P25116
Residue:425
BDBM50260517
NameBDBM50260517
Synonyms:CHEMBL460583 | ethyl (1R,3aR,4aR,6R,8aR,9S,9aS)-9-((E)-2-(5-(3-carbamoylphenyl)pyridin-2-yl)vinyl)-1-methyl-3-oxo-dodecahydronaphtho[2,3-c]furan-6-ylcarbamate
TypeSmall organic molecule
Emp. Form.C30H35N3O5
Mol. Mass.517.616
SMILESCCOC(=O)N[C@@H]1CC[C@@H]2[C@H](C[C@@H]3[C@@H]([C@@H](C)OC3=O)[C@H]2C=Cc2ccc(cn2)-c2cccc(c2)C(N)=O)C1