Reaction Details
TargetProteinase-activated receptor 1
LigandBDBM50261018
Substrate/Competitorn/a
Meas. Tech.ChEMBL_556010 (CHEMBL964660)
Ki 6.5±n/a nM
Citation Chackalamannil, SWang, YGreenlee, WJHu, ZXia, YAhn, HSBoykow, GHsieh, YPalamanda, JAgans-Fantuzzi, JKurowski, SGraziano, MChintala, M Discovery of a novel, orally active himbacine-based thrombin receptor antagonist (SCH 530348) with potent antiplatelet activity. J Med Chem51:3061-4 (2008) 
 
Proteinase-activated receptor 1
Name:Proteinase-activated receptor 1
Type:Protein
Mol. Mass.:47450.07
Organism:Homo sapiens (Human)
Description:P25116
Residue:425
BDBM50261018
NameBDBM50261018
Synonyms:CHEMBL494618 | N-((1R,3aR,4aR,6R,8aR,9S,9aS)-9-((E)-2-(5-(3-fluorophenyl)pyridin-2-yl)vinyl)-1-methyl-3-oxo-dodecahydronaphtho[2,3-c]furan-6-yl)cyclopropanecarboxamide
TypeSmall organic molecule
Emp. Form.C30H33FN2O3
Mol. Mass.488.593
SMILESC[C@H]1OC(=O)[C@@H]2C[C@@H]3C[C@@H](CC[C@H]3[C@H](\C=C\c3ccc(cn3)-c3cccc(F)c3)[C@H]12)NC(=O)C1CC1