Reaction Details
TargetMu-type opioid receptor
LigandBDBM50260633
Substrate/Competitorn/a
Meas. Tech.ChEMBL_556068 (CHEMBL953421)
IC50 25±n/a nM
Citation Okamoto, OKobayashi, KKawamoto, HIto, SYoshizumi, TYamamoto, IHashimoto, MShimizu, ATakahashi, HIshii, YOzaki, SOhta, H Novel ORL1-selective antagonists with oral bioavailability and brain penetrability. Bioorg Med Chem Lett18:3282-5 (2008) 
 
Mu-type opioid receptor
Name:Mu-type opioid receptor
Type:G Protein-Coupled Receptor (GPCR)
Mol. Mass.:44789.51
Organism:Homo sapiens (Human)
Description:P35372
Residue:400
BDBM50260633
NameBDBM50260633
Synonyms:(S)-2-(4-(2-(tert-butylthio)-6-chloro-3H-benzo[d]imidazol-5-yl)-3-methylpiperazin-1-yl)ethanol | CHEMBL495402
TypeSmall organic molecule
Emp. Form.C18H27ClN4OS
Mol. Mass.382.951
SMILESC[C@H]1CN(CCO)CCN1c1cc2[nH]c(SC(C)(C)C)nc2cc1Cl