Reaction Details
TargetNociceptin receptor
LigandBDBM50260632
Substrate/Competitorn/a
Meas. Tech.ChEMBL_556066 (CHEMBL953419)
IC50 27±n/a nM
Citation Okamoto, OKobayashi, KKawamoto, HIto, SYoshizumi, TYamamoto, IHashimoto, MShimizu, ATakahashi, HIshii, YOzaki, SOhta, H Novel ORL1-selective antagonists with oral bioavailability and brain penetrability. Bioorg Med Chem Lett18:3282-5 (2008) 
 
Nociceptin receptor
Name:Nociceptin receptor
Type:G Protein-Coupled Receptor (GPCR)
Mol. Mass.:40702.87
Organism:Homo sapiens (Human)
Description:P41146
Residue:370
BDBM50260632
NameBDBM50260632
Synonyms:2-((1S,4S)-5-(6-chloro-2-(pentan-3-ylthio)-3H-benzo[d]imidazol-5-yl)-2,5-diaza-bicyclo[2.2.1]heptan-2-yl)ethanol | CHEMBL523724
TypeSmall organic molecule
Emp. Form.C19H27ClN4OS
Mol. Mass.394.962
SMILESCCC(CC)Sc1nc2cc(Cl)c(cc2[nH]1)N1C[C@@H]2C[C@H]1CN2CCO