Reaction Details
TargetNociceptin receptor
LigandBDBM50260631
Substrate/Competitorn/a
Meas. Tech.ChEMBL_556066 (CHEMBL953419)
IC50 59±n/a nM
Citation Okamoto, OKobayashi, KKawamoto, HIto, SYoshizumi, TYamamoto, IHashimoto, MShimizu, ATakahashi, HIshii, YOzaki, SOhta, H Novel ORL1-selective antagonists with oral bioavailability and brain penetrability. Bioorg Med Chem Lett18:3282-5 (2008) 
 
Nociceptin receptor
Name:Nociceptin receptor
Type:G Protein-Coupled Receptor (GPCR)
Mol. Mass.:40702.87
Organism:Homo sapiens (Human)
Description:P41146
Residue:370
BDBM50260631
NameBDBM50260631
Synonyms:2-(4-(6-chloro-2-(pentan-3-ylthio)-3H-benzo[d]imidazol-5-yl)-2,2-dimethylpiperazin-1-yl)ethanol | CHEMBL525054
TypeSmall organic molecule
Emp. Form.C20H31ClN4OS
Mol. Mass.411.004
SMILESCCC(CC)Sc1nc2cc(Cl)c(cc2[nH]1)N1CCN(CCO)C(C)(C)C1