Reaction Details
TargetQueuine tRNA-ribosyltransferase catalytic subunit 1
LigandBDBM50240341
Substrate/Competitorn/a
Meas. Tech.ChEMBL_553551 (CHEMBL958734)
Ki 2100±n/a nM
Citation Congreve, MChessari, GTisi, DWoodhead, AJ Recent developments in fragment-based drug discovery. J Med Chem51:3661-80 (2008) 
 
Queuine tRNA-ribosyltransferase catalytic subunit 1
Name:Queuine tRNA-ribosyltransferase catalytic subunit 1
Type:PROTEIN
Mol. Mass.:44051.79
Organism:Homo sapiens (Human)
Description:ChEMBL_553551
Residue:403
BDBM50240341
NameBDBM50240341
Synonyms:2-AMINOQUINAZOLIN-4(3H)-ONE CHEMBL6993
TypeSmall organic molecule
Emp. Form.C8H7N3O
Mol. Mass.161.1607
SMILESNc1nc2ccccc2c(=O)[nH]1