Reaction Details
TargetUrokinase-type plasminogen activator
LigandBDBM50092659
Substrate/Competitorn/a
Meas. Tech.ChEMBL_553536 (CHEMBL958719)
IC50 200000±n/a nM
Citation Congreve, MChessari, GTisi, DWoodhead, AJ Recent developments in fragment-based drug discovery. J Med Chem51:3661-80 (2008) 
 
Urokinase-type plasminogen activator
Name:Urokinase-type plasminogen activator
Type:Enzyme
Mol. Mass.:48528.62
Organism:Homo sapiens (Human)
Description:P00749
Residue:431
BDBM50092659
NameBDBM50092659
Synonyms:2-AMINO-5-HYDROXY-BENZIMIDAZOLE 2-amino-3H-benzo[d]imidazol-5-ol | CHEMBL126589
TypeSmall organic molecule
Emp. Form.C7H7N3O
Mol. Mass.149.15
SMILESNc1nc2ccc(O)cc2[nH]1