Reaction Details
TargetMethionine aminopeptidase 2
LigandBDBM17462
Substrate/Competitorn/a
Meas. Tech.ChEMBL_553550 (CHEMBL958733)
IC50 18±n/a nM
Citation Congreve, MChessari, GTisi, DWoodhead, AJ Recent developments in fragment-based drug discovery. J Med Chem51:3661-80 (2008) 
 
Methionine aminopeptidase 2
Name:Methionine aminopeptidase 2
Type:Enzyme
Mol. Mass.:52884.45
Organism:Homo sapiens (Human)
Description:P50579
Residue:478
BDBM17462
NameBDBM17462
Synonyms:1,2,3-triazole analogue, 18 CHEMBL194853
TypeSmall organic molecule
Emp. Form.C9H9N3
Mol. Mass.159.1879
SMILESCc1cccc(c1)-c1c[nH]nn1