Reaction Details
TargetRAC-alpha serine/threonine-protein kinase
LigandBDBM16215
Substrate/Competitorn/a
Meas. Tech.ChEMBL_553535 (CHEMBL958718)
IC50 135000±n/a nM
Citation Congreve, MChessari, GTisi, DWoodhead, AJ Recent developments in fragment-based drug discovery. J Med Chem51:3661-80 (2008) 
 
RAC-alpha serine/threonine-protein kinase
Name:RAC-alpha serine/threonine-protein kinase
Type:Enzyme
Mol. Mass.:55681.25
Organism:Homo sapiens (Human)
Description:P31749
Residue:480
BDBM16215
NameBDBM16215
Synonyms:4-phenyl-1H-pyrazole JMC514968 Compound 35 | pyrazole-based inhibitor 5
TypeSmall organic molecule
Emp. Form.C9H8N2
Mol. Mass.144.1732
SMILESc1n[nH]cc1-c1ccccc1