Reaction Details
TargetBcl2-associated agonist of cell death
LigandBDBM50270875
Substrate/Competitorn/a
Meas. Tech.ChEMBL_553538 (CHEMBL958721)
Kd 2000000±n/a nM
Citation Congreve, MChessari, GTisi, DWoodhead, AJ Recent developments in fragment-based drug discovery. J Med Chem51:3661-80 (2008) 
 
Bcl2-associated agonist of cell death
Name:Bcl2-associated agonist of cell death
Type:PROTEIN
Mol. Mass.:18393.69
Organism:Homo sapiens (Human)
Description:ChEMBL_478760
Residue:168
BDBM50270875
NameBDBM50270875
Synonyms:5,6,7,8-tetrahydro-1-naphthol | CHEMBL449132
TypeSmall organic molecule
Emp. Form.C10H12O
Mol. Mass.148.2017
SMILESOc1cccc2CCCCc12