Reaction Details
TargetCarbonic anhydrase 2
LigandBDBM50271035
Substrate/Competitorn/a
Meas. Tech.ChEMBL_553540 (CHEMBL958723)
Kd 0.200000±n/a nM
Citation Congreve, MChessari, GTisi, DWoodhead, AJ Recent developments in fragment-based drug discovery. J Med Chem51:3661-80 (2008) 
 
Carbonic anhydrase 2
Name:Carbonic anhydrase 2
Type:Enzyme Catalytic Domain
Mol. Mass.:29115.93
Organism:Bos taurus
Description:n/a
Residue:260
BDBM50271035
NameBDBM50271035
Synonyms:(S)-4-(1-(1-(3-aza-bicyclo[3.2.2]nonan-3-yl)-3-methyl-1-oxobutan-2-yl)-1H-1,2,3-triazol-4-yl)benzenesulfonamide | CHEMBL487938
TypeSmall organic molecule
Emp. Form.C21H29N5O3S
Mol. Mass.431.552
SMILESCC(C)[C@@H](C(=O)N1CC2CCC(CC2)C1)n1cc(nn1)-c1ccc(cc1)S(N)(=O)=O