Reaction Details
TargetCaspase-1
LigandBDBM50176510
Substrate/Competitorn/a
Meas. Tech.ChEMBL_553541 (CHEMBL958724)
IC50 5±n/a nM
Citation Congreve, MChessari, GTisi, DWoodhead, AJ Recent developments in fragment-based drug discovery. J Med Chem51:3661-80 (2008) 
 
Caspase-1
Name:Caspase-1
Type:Enzyme
Mol. Mass.:45154.13
Organism:Homo sapiens (Human)
Description:P29466
Residue:404
BDBM50176510
NameBDBM50176510
Synonyms:(S)-4-oxo-3-(2-((4-(quinoxalin-2-ylamino)benzamido)methyl)nicotinamido)butanoic acid CHEMBL202160
TypeSmall organic molecule
Emp. Form.C26H22N6O5
Mol. Mass.498.4901
SMILESOC(=O)C[C@H](NC(=O)c1ccc(CNC(=O)c2ccc(Nc3cnc4ccccc4n3)cc2)nc1)C=O