Reaction Details
TargetAurora kinase A
LigandBDBM50270610
Substrate/Competitorn/a
Meas. Tech.ChEMBL_553554 (CHEMBL958737)
IC50 3000±n/a nM
Citation Congreve, MChessari, GTisi, DWoodhead, AJ Recent developments in fragment-based drug discovery. J Med Chem51:3661-80 (2008) 
 
Aurora kinase A
Name:Aurora kinase A
Type:Serine/threonine-protein kinase
Mol. Mass.:45830.98
Organism:Homo sapiens (Human)
Description:O14965
Residue:403
BDBM50270610
NameBDBM50270610
Synonyms:4-chloro-6,7-dimethoxy-9H-pyrimido[4,5-b]indole | CHEMBL482663
TypeSmall organic molecule
Emp. Form.C12H10ClN3O2
Mol. Mass.263.68
SMILESCOc1cc2[nH]c3ncnc(Cl)c3c2cc1OC