Reaction Details
TargetProstaglandin E synthase 2
LigandBDBM50168761
Substrate/Competitorn/a
Meas. Tech.ChEMBL_553563 (CHEMBL958746)
IC50>1000±n/a nM
Citation Friesen, RWMancini, JA Microsomal prostaglandin E2 synthase-1 (mPGES-1): a novel anti-inflammatory therapeutic target. J Med Chem51:4059-67 (2008) 
 
Prostaglandin E synthase 2
Name:Prostaglandin E synthase 2
Type:Enzyme
Mol. Mass.:41955.21
Organism:Homo sapiens (Human)
Description:Q9H7Z7
Residue:377
BDBM50168761
NameBDBM50168761
Synonyms:3-(1-(4-chlorobenzyl)-5-(2-fluorobiphenyl-4-yl)-3-methyl-1H-indol-2-yl)-2,2-dimethylpropanoic acid CHEMBL182032
TypeSmall organic molecule
Emp. Form.C33H29ClFNO2
Mol. Mass.526.04
SMILESCc1c(CC(C)(C)C(O)=O)n(Cc2ccc(Cl)cc2)c2ccc(cc12)-c1ccc(c(F)c1)-c1ccccc1