Reaction Details
TargetSigma non-opioid intracellular receptor 1
LigandBDBM50261133
Substrate/Competitorn/a
Meas. Tech.ChEMBL_552367 (CHEMBL1005957)
Ki 3±n/a nM
Citation Smith, TAYang, XWu, HPouw, BMatsumoto, RRCoop, A Trifluoromethoxyl substituted phenylethylene diamines as high affinity sigma receptor ligands with potent anti-cocaine actions. J Med Chem51:3322-5 (2008) 
 
Sigma non-opioid intracellular receptor 1
Name:Sigma non-opioid intracellular receptor 1
Type:Enzyme Catalytic Domain
Mol. Mass.:25266.54
Organism:RAT
Description:Q9R0C9
Residue:223
BDBM50261133
NameBDBM50261133
Synonyms:CHEMBL497549 | N-Methyl-2-piperidin-1-yl-N-{2-[3-(trifluoromethoxy)phenyl]-ethyl}ethanamine
TypeSmall organic molecule
Emp. Form.C17H25F3N2O
Mol. Mass.330.3884
SMILESCN(CCN1CCCCC1)CCc1cccc(OC(F)(F)F)c1