Reaction Details
TargetSigma non-opioid intracellular receptor 1
LigandBDBM50261084
Substrate/Competitorn/a
Meas. Tech.ChEMBL_552367 (CHEMBL1005957)
Ki 2±n/a nM
Citation Smith, TAYang, XWu, HPouw, BMatsumoto, RRCoop, A Trifluoromethoxyl substituted phenylethylene diamines as high affinity sigma receptor ligands with potent anti-cocaine actions. J Med Chem51:3322-5 (2008) 
 
Sigma non-opioid intracellular receptor 1
Name:Sigma non-opioid intracellular receptor 1
Type:Enzyme Catalytic Domain
Mol. Mass.:25266.54
Organism:RAT
Description:Q9R0C9
Residue:223
BDBM50261084
NameBDBM50261084
Synonyms:CHEMBL526849 | N-Ethyl-2-piperidin-1-yl-N-{2-[4-(trifluoromethoxy)phenyl]-ethyl}ethanamine
TypeSmall organic molecule
Emp. Form.C18H27F3N2O
Mol. Mass.344.415
SMILESCCN(CCN1CCCCC1)CCc1ccc(OC(F)(F)F)cc1