Reaction Details
TargetGlutamine synthetase
LigandBDBM50260541
Substrate/Competitorn/a
Meas. Tech.ChEMBL_555758 (CHEMBL959115)
Ki 21000±n/a nM
Citation Nordqvist, ANilsson, MTRöttger, SOdell, LRKrajewski, WWEvalena Andersson, CLarhed, MMowbray, SLKarlén, A Evaluation of the amino acid binding site of Mycobacterium tuberculosis glutamine synthetase for drug discovery. Bioorg Med Chem16:5501-13 (2008) 
 
Glutamine synthetase
Name:Glutamine synthetase
Synonyms:n/a
Type:PROTEIN
Mol. Mass.:39098.57
Organism:Glycine max
Description:ChEMBL_555758
Residue:355
BDBM50260541
NameBDBM50260541
TypeSmall organic molecule
Emp. Form.C4H10N2O3
Mol. Mass.134.1338
SMILESN[C@@H](CCNO)C(O)=O