Reaction Details
TargetLanosterol synthase
LigandBDBM50271620
Substrate/Competitorn/a
Meas. Tech.ChEMBL_556115 (CHEMBL956674)
IC50 32±n/a nM
Citation Fouchet, MHDonche, FMartin, CBouillot, AJunot, CBoullay, ABPotvain, FMagny, SDCoste, HWalker, MIssandou, MDodic, N Design and evaluation of a novel series of 2,3-oxidosqualene cyclase inhibitors with low systemic exposure, relationship between pharmacokinetic properties and ocular toxicity. Bioorg Med Chem16:6218-32 (2008) 
 
Lanosterol synthase
Name:Lanosterol synthase
Type:PROTEIN
Mol. Mass.:83309.32
Organism:Homo sapiens (Human)
Description:ChEMBL_11231
Residue:732
BDBM50271620
NameBDBM50271620
Synonyms:1-[4-Chlorophenylsulfonyl]-4-[4-(dimethylaminomethyl)phenylmethyl]-piperazine | CHEMBL521168
TypeSmall organic molecule
Emp. Form.C20H26ClN3O2S
Mol. Mass.407.957
SMILESCN(C)Cc1ccc(CN2CCN(CC2)S(=O)(=O)c2ccc(Cl)cc2)cc1