Reaction Details
TargetEpidermal growth factor receptor
LigandBDBM50271851
Substrate/Competitorn/a
Meas. Tech.ChEMBL_556139 (CHEMBL957461)
IC50 3180±n/a nM
Citation Gangjee, ANamjoshi, OAYu, JIhnat, MAThorpe, JEWarnke, LA Design, synthesis and biological evaluation of substituted pyrrolo[2,3-d]pyrimidines as multiple receptor tyrosine kinase inhibitors and antiangiogenic agents. Bioorg Med Chem16:5514-28 (2008) 
 
Epidermal growth factor receptor
Name:Epidermal growth factor receptor
Type:Receptor Kinase Domain
Mol. Mass.:134279.59
Organism:Homo sapiens (Human)
Description:P00533
Residue:1210
BDBM50271851
NameBDBM50271851
Synonyms:CHEMBL519147 | N4-(4-Chlorophenyl)-6-(2-phenylethyl)-7H-pyrrolo[2,3-d ]pyrimidine-2,4-diamine
TypeSmall organic molecule
Emp. Form.C20H18ClN5
Mol. Mass.363.843
SMILESNc1nc(Nc2ccc(Cl)cc2)c2cc(CCc3ccccc3)[nH]c2n1