Reaction Details
TargetVascular endothelial growth factor receptor 1
LigandBDBM50271905
Substrate/Competitorn/a
Meas. Tech.ChEMBL_556140 (CHEMBL957462)
IC50>200000±n/a nM
Citation Gangjee, ANamjoshi, OAYu, JIhnat, MAThorpe, JEWarnke, LA Design, synthesis and biological evaluation of substituted pyrrolo[2,3-d]pyrimidines as multiple receptor tyrosine kinase inhibitors and antiangiogenic agents. Bioorg Med Chem16:5514-28 (2008) 
 
Vascular endothelial growth factor receptor 1
Name:Vascular endothelial growth factor receptor 1
Type:Receptor Tyrosine Kinase
Mol. Mass.:150800.23
Organism:Homo sapiens (Human)
Description:P17948
Residue:1338
BDBM50271905
NameBDBM50271905
Synonyms:CHEMBL499067 N4-1H-indol-5-yl-6-(2-phenylethyl)-7H-pyrrolo[2,3-d]pyrimidine-2,4-diamine
TypeSmall organic molecule
Emp. Form.C22H20N6
Mol. Mass.368.4344
SMILESNc1nc(Nc2ccc3[nH]ccc3c2)c2cc(CCc3ccccc3)[nH]c2n1