Reaction Details
TargetPlatelet-derived growth factor receptor beta
LigandBDBM50271852
Substrate/Competitorn/a
Meas. Tech.ChEMBL_556142 (CHEMBL957464)
IC50 90000±n/a nM
Citation Gangjee, ANamjoshi, OAYu, JIhnat, MAThorpe, JEWarnke, LA Design, synthesis and biological evaluation of substituted pyrrolo[2,3-d]pyrimidines as multiple receptor tyrosine kinase inhibitors and antiangiogenic agents. Bioorg Med Chem16:5514-28 (2008) 
 
Platelet-derived growth factor receptor beta
Name:Platelet-derived growth factor receptor beta
Type:Enzyme
Mol. Mass.:123922.25
Organism:Homo sapiens (Human)
Description:P09619
Residue:1106
BDBM50271852
NameBDBM50271852
Synonyms:CHEMBL482715 N4-[4-Fluoro-3-(trifluoromethyl)phenyl]-6-(2-phenylethyl)-7H-pyrrolo[2,3-d]pyrimidine-2,4-diamine
TypeSmall organic molecule
Emp. Form.C21H17F4N5
Mol. Mass.415.3868
SMILESNc1nc(Nc2ccc(F)c(c2)C(F)(F)F)c2cc(CCc3ccccc3)[nH]c2n1