Reaction Details
TargetVascular endothelial growth factor receptor 2
LigandBDBM50271852
Substrate/Competitorn/a
Meas. Tech.ChEMBL_556141 (CHEMBL957463)
IC50>200000±n/a nM
Citation Gangjee, ANamjoshi, OAYu, JIhnat, MAThorpe, JEWarnke, LA Design, synthesis and biological evaluation of substituted pyrrolo[2,3-d]pyrimidines as multiple receptor tyrosine kinase inhibitors and antiangiogenic agents. Bioorg Med Chem16:5514-28 (2008) 
 
Vascular endothelial growth factor receptor 2
Name:Vascular endothelial growth factor receptor 2
Type:Receptor Tyrosine Kinase
Mol. Mass.:151510.97
Organism:Homo sapiens (Human)
Description:P35968
Residue:1356
BDBM50271852
NameBDBM50271852
Synonyms:CHEMBL482715 N4-[4-Fluoro-3-(trifluoromethyl)phenyl]-6-(2-phenylethyl)-7H-pyrrolo[2,3-d]pyrimidine-2,4-diamine
TypeSmall organic molecule
Emp. Form.C21H17F4N5
Mol. Mass.415.3868
SMILESNc1nc(Nc2ccc(F)c(c2)C(F)(F)F)c2cc(CCc3ccccc3)[nH]c2n1