Reaction Details
TargetThymidylate kinase
LigandBDBM50271448
Substrate/Competitorn/a
Meas. Tech.ChEMBL_556415 (CHEMBL954907)
Ki 6500±n/a nM
Citation Gasse, CDouguet, DHuteau, VMarchal, GMunier-Lehmann, HPochet, S Substituted benzyl-pyrimidines targeting thymidine monophosphate kinase of Mycobacterium tuberculosis: synthesis and in vitro anti-mycobacterial activity. Bioorg Med Chem16:6075-85 (2008) 
 
Thymidylate kinase
Name:Thymidylate kinase
Type:PROTEIN
Mol. Mass.:22636.29
Organism:Mycobacterium tuberculosis
Description:ChEMBL_208218
Residue:214
BDBM50271448
NameBDBM50271448
Synonyms:5-[5-Chloro-4-(2,4-dioxo-3,4-dihydro-2H-pyrimidin-1-yl-methyl)-phenyl]-butanoic acid | CHEMBL520293
TypeSmall organic molecule
Emp. Form.C15H15ClN2O4
Mol. Mass.322.744
SMILESOC(=O)CCCc1ccc(Cn2cc(Cl)c(=O)[nH]c2=O)cc1