Reaction Details
TargetLysophosphatidic acid receptor 3
LigandBDBM50271764
Substrate/Competitorn/a
Meas. Tech.ChEMBL_556428 (CHEMBL955645)
IC50 13850±n/a nM
Citation Fells, JITsukahara, RFujiwara, YLiu, JPerygin, DHOsborne, DATigyi, GParrill, AL Identification of non-lipid LPA3 antagonists by virtual screening. Bioorg Med Chem16:6207-17 (2008) 
 
Lysophosphatidic acid receptor 3
Name:Lysophosphatidic acid receptor 3
Type:Enzyme
Mol. Mass.:40149.72
Organism:Homo sapiens (Human)
Description:Q9UBY5
Residue:353
BDBM50271764
NameBDBM50271764
Synonyms:3-[4'-(3-Carboxy-acryloylamino)-biphenyl-4-ylcarbamoyl]-acrylic acid | CHEMBL482497
TypeSmall organic molecule
Emp. Form.C20H16N2O6
Mol. Mass.380.3508
SMILESOC(=O)\C=C\C(=O)Nc1ccc(cc1)-c1ccc(NC(=O)\C=C\C(O)=O)cc1