Reaction Details
TargetMu-type opioid receptor
LigandBDBM50272031
Substrate/Competitorn/a
Meas. Tech.ChEMBL_556453 (CHEMBL955670)
IC50 0.32±n/a nM
Citation Koda, YDel Borgo, MWessling, STLazarus, LHOkada, YToth, IBlanchfield, JT Synthesis and in vitro evaluation of a library of modified endomorphin 1 peptides. Bioorg Med Chem16:6286-96 (2008) 
 
Mu-type opioid receptor
Name:Mu-type opioid receptor
Type:G Protein-Coupled Receptor (GPCR)
Mol. Mass.:44789.51
Organism:Homo sapiens (Human)
Description:P35372
Residue:400
BDBM50272031
NameBDBM50272031
Synonyms:(S)-N-((S)-1-((S)-1-amino-1-oxo-3-phenylpropan-2-ylamino)-3-(1H-indol-3-yl)-1-oxopropan-2-yl)-1-((S)-2-(2-aminooctanamido)-3-(4-hydroxy-2,6-dimethylphenyl)propanoyl)pyrrolidine-2-carboxamide | CHEMBL509528
TypeSmall organic molecule
Emp. Form.C44H57N7O6
Mol. Mass.779.9667
SMILESCCCCCCC(N)C(=O)N[C@@H](Cc1c(C)cc(O)cc1C)C(=O)N1CCC[C@H]1C(=O)N[C@@H](Cc1c[nH]c2ccccc12)C(=O)N[C@@H](Cc1ccccc1)C(N)=O