Reaction Details
TargetBeta-secretase 1
LigandBDBM50271768
Substrate/Competitorn/a
Meas. Tech.ChEMBL_556474 (CHEMBL955691)
IC50 10±n/a nM
Citation Cumming, JNLe, TXBabu, SCarroll, CChen, XFavreau, LGaspari, PGuo, THobbs, DWHuang, YIserloh, UKennedy, MEKuvelkar, RLi, GLowrie, JMcHugh, NAOzgur, LPan, JParker, EMSaionz, KStamford, AWStrickland, CTadesse, DVoigt, JWang, LWu, YZhang, LZhang, Q Rational design of novel, potent piperazinone and imidazolidinone BACE1 inhibitors. Bioorg Med Chem Lett18:3236-41 (2008) 
 
Beta-secretase 1
Name:Beta-secretase 1
Type:Protein
Mol. Mass.:55755.10
Organism:Homo sapiens (Human)
Description:P56817
Residue:501
BDBM50271768
NameBDBM50271768
Synonyms:CHEMBL491659 | N-((1S,2S)-1-((S)-4-benzyl-3-oxopiperazin-2-yl)-3-(3,5-difluorophenyl)-1-hydroxypropan-2-yl)-1-(cyclopropylmethyl)-5-oxopyrrolidine-3-carboxamide
TypeSmall organic molecule
Emp. Form.C29H34F2N4O4
Mol. Mass.540.6015
SMILESO[C@@H]([C@H](Cc1cc(F)cc(F)c1)NC(=O)C1CN(CC2CC2)C(=O)C1)[C@@H]1NCCN(Cc2ccccc2)C1=O